HTML
type: Text
type: Document
format: text/html

JSON
type: Text
type: Document
format: application/json

Turtle
type: Text
type: Document
format: text/plain

Expression of Core FRBR Concepts in RDF
type: Ontology
date: 2009-05-16
comment: This vocabulary is an expression in RDF of the concepts and relations described in the IFLA report on the Functional Requirements for Bibliographic Records (FRBR).
comment: This vocabulary is a work in progress, it includes RDF classes for the group 1, 2 and 3 entities described by the FRBR report and properties corresponding to the core relationships between those entities. It does not yet describe attributes of the entities. Where possible, appropriate relationships with other vocabularies are included in order to place this vocabulary in the context of existing RDF work.
is version of: core#
creator: Ian Davis
creator: Richard Newman
contributor: Bruce D'Arcus
rights: Copyright © 2005 Richard Newman and Ian Davis
replaces: frbr-core-20050809
preferred namespace uri: http://purl.org/vocab/frbr/core#
preferred namespace prefix: frbr
example: frbr-example-film-20050809.html
issued: 2005-07-15
history note: Added type hierarchy
  date: 2005-10-14
  creator: Ian Davis
change note: Various minor tidying tasks
  date: 2009-05-16
  creator: Ian Davis

Ian Davis
type: Person

Bruce D'Arcus
type: Person

endeavour
type: Class
definition: Any of the products of artistic or creative endeavour.
comment: This class represents any one of the FRBR group one entities.
disjoint with: responsible entity
disjoint with: subject
equivalent class: the union of all expressions, items, manifestations and works
  type: Class
  union of: expression
  union of: item
  union of: manifestation
  union of: work
issued: 2005-07-15
change note: Added isDefinedBy property referring to FRBR core namespace
  date: 2005-08-08
  creator: Ian Davis
change note: Added comment
  date: 2005-08-08
  creator: Ian Davis
change note: Extracted definition from existing comment
  date: 2005-08-09
  creator: Ian Davis

expression
type: Class
definition: A realization of a single work usually in a physical form.
comment: This class corresponds to the FRBR group one entity 'Expression'.
subclass of: endeavour
disjoint with: work
disjoint with: item
disjoint with: manifestation
issued: 2005-07-15
change note: Added isDefinedBy property referring to FRBR core namespace
  date: 2005-08-08
  creator: Ian Davis
change note: Added comment
  date: 2005-08-08
  creator: Ian Davis
change note: Extracted definition from existing comment
  date: 2005-08-09
  creator: Ian Davis

item
type: Class
definition: An exemplar of a single manifestation.
comment: This class corresponds to the FRBR group one entity 'Item'.
subclass of: endeavour
disjoint with: work
disjoint with: expression
disjoint with: manifestation
issued: 2005-07-15
change note: Added isDefinedBy property referring to FRBR core namespace
  date: 2005-08-08
  creator: Ian Davis
change note: Added comment
  date: 2005-08-08
  creator: Ian Davis
change note: Extracted definition from existing comment
  date: 2005-08-09
  creator: Ian Davis
history note: Made subclass of geo:SpatialThing
  date: 2005-08-08
  creator: Ian Davis
history note: Removed subclass of geo:SpatialThing
  date: 2005-08-10
  creator: Ian Davis

manifestation
type: Class
definition: The physical embodiment of one or more expressions.
comment: This class corresponds to the FRBR group one entity 'Manifestation'.
subclass of: endeavour
disjoint with: work
disjoint with: expression
disjoint with: item
issued: 2005-07-15
change note: Added isDefinedBy property referring to FRBR core namespace
  date: 2005-08-08
  creator: Ian Davis
change note: Added comment
  date: 2005-08-08
  creator: Ian Davis
change note: Extracted definition from existing comment
  date: 2005-08-09
  creator: Ian Davis

work
type: Class
definition: An abstract notion of an artistic or intellectual creation.
comment: This class corresponds to the FRBR group one entity 'Work'.
subclass of: endeavour
subclass of: Work~2
disjoint with: expression
disjoint with: manifestation
disjoint with: item
issued: 2005-07-15
change note: Added isDefinedBy property referring to FRBR core namespace
  date: 2005-08-08
  creator: Ian Davis
change note: Added comment
  date: 2005-08-08
  creator: Ian Davis
change note: Extracted definition from existing comment
  date: 2005-08-09
  creator: Ian Davis
history note: Made subclass of wordnet:Work~2
  date: 2005-08-08
  creator: Ian Davis

responsible entity
type: Class
definition: One responsible for the creation, production, distribution or maintenance of artistic or creative content.
comment: This class represents any of the FRBR group two entities.
disjoint with: endeavour
disjoint with: subject
equivalent class: the union of all people and corporate bodies
  type: Class
  union of: corporate body
  union of: Person
issued: 2005-07-15
change note: Added isDefinedBy property referring to FRBR core namespace
  date: 2005-08-08
  creator: Ian Davis
change note: Added comment
  date: 2005-08-08
  creator: Ian Davis
change note: Extracted definition from existing comment
  date: 2005-08-09
  creator: Ian Davis

corporate body
type: Class
definition: An organization or group of individuals and/or other organizations.
comment: This class corresponds to the FRBR group two entity 'Corporate Body'.
subclass of: responsible entity
equivalent class: the union of all organizations and groups
  type: Class
  union of: Organization
  union of: Group
issued: 2005-07-15
change note: Added isDefinedBy property referring to FRBR core namespace
  date: 2005-08-08
  creator: Ian Davis
change note: Added comment
  date: 2005-08-08
  creator: Ian Davis
change note: Extracted definition from existing comment
  date: 2005-08-09
  creator: Ian Davis

person
type: Class
definition: A living or dead individual.
comment: This class corresponds to the FRBR group two entity 'Person'.
disjoint with: endeavour
disjoint with: subject
equivalent class: Person
issued: 2005-08-08
change note: Added isDefinedBy property referring to FRBR core namespace
  date: 2005-08-08
  creator: Ian Davis
change note: Added comment
  date: 2005-08-08
  creator: Ian Davis
change note: Extracted definition from existing comment
  date: 2005-08-09
  creator: Ian Davis

subject
type: Class
definition: Something that may serve as the subject of a work.
comment: This class represents any of the FRBR group three entities.
disjoint with: responsible entity
disjoint with: endeavour
equivalent class: the union of all events, objects, places and concepts
  type: Class
  union of: event
  union of: object
  union of: place
  union of: concept
issued: 2005-07-15
change note: Added isDefinedBy property referring to FRBR core namespace
  date: 2005-08-08
  creator: Ian Davis
change note: Added comment
  date: 2005-08-08
  creator: Ian Davis
change note: Extracted definition from existing comment
  date: 2005-08-09
  creator: Ian Davis

event
type: Class
definition: An action or occurrence.
comment: This class corresponds to the FRBR group three entity 'Event'.
subclass of: subject
subclass of: Event
disjoint with: place
disjoint with: object
disjoint with: concept
issued: 2005-07-15
change note: Added comment
  date: 2005-08-08
  creator: Ian Davis
change note: Extracted definition from existing comment
  date: 2005-08-09
  creator: Ian Davis
history note: Made subclass of owltime:Event
  date: 2005-08-08
  creator: Ian Davis

object
type: Class
definition: A tangible or material thing.
comment: This class corresponds to the FRBR group three entity 'Object'.
subclass of: subject
subclass of: SpatialThing
disjoint with: event
disjoint with: place
disjoint with: concept
issued: 2005-07-15
change note: Added isDefinedBy property referring to FRBR core namespace
  date: 2005-08-08
  creator: Ian Davis
change note: Added comment
  date: 2005-08-08
  creator: Ian Davis
change note: Extracted definition from existing comment
  date: 2005-08-09
  creator: Ian Davis
history note: Made subclass of geo:SpatialThing
  date: 2005-08-08
  creator: Ian Davis

place
type: Class
definition: A location.
comment: This class corresponds to the FRBR group three entity 'Place'.
subclass of: subject
subclass of: SpatialThing
disjoint with: event
disjoint with: object
disjoint with: concept
issued: 2005-07-15
change note: Added isDefinedBy property referring to FRBR core namespace
  date: 2005-08-08
  creator: Ian Davis
change note: Added comment
  date: 2005-08-08
  creator: Ian Davis
change note: Extracted definition from existing comment
  date: 2005-08-09
  creator: Ian Davis
history note: Made subclass of geo:SpatialThing
  date: 2005-08-08
  creator: Ian Davis

concept
type: Class
definition: An abstract idea or notion.
comment: This class corresponds to the FRBR group three entity 'Concept'.
subclass of: subject
subclass of: Concept
disjoint with: object
disjoint with: event
disjoint with: place
issued: 2005-07-15
change note: Added isDefinedBy property referring to FRBR core namespace
  date: 2005-08-08
  creator: Ian Davis
change note: Added comment
  date: 2005-08-08
  creator: Ian Davis
change note: Extracted definition from existing comment
  date: 2005-08-09
  creator: Ian Davis
history note: Made subclass of skos:Concept
  date: 2005-08-08
  creator: Ian Davis

classical work
type: Class
subclass of: work
issued: 2005-10-14

legal work
type: Class
subclass of: work
issued: 2005-10-14

literary work
type: Class
subclass of: work
issued: 2005-10-14

scholarly work
type: Class
subclass of: work
issued: 2005-10-14

text
type: Class
subclass of: expression
issued: 2005-10-14

image
type: Class
subclass of: expression
issued: 2005-10-14

sound
type: Class
subclass of: expression
issued: 2005-10-14

moving image
type: Class
subclass of: expression
issued: 2005-10-14

data
type: Class
subclass of: expression
issued: 2005-10-14

performance
type: Class
subclass of: expression
issued: 2005-10-14

related endeavour
type: ObjectProperty
definition: Another endeavour that is related in some way to an endeavour.
domain: endeavour
range: endeavour
issued: 2005-07-15
change note: Added isDefinedBy property referring to FRBR core namespace
  date: 2005-08-08
  creator: Ian Davis
change note: Added definition
  date: 2005-08-09
  creator: Ian Davis

realization
type: ObjectProperty
definition: An expression that is an intellectual or artistic realization of a work.
domain: work
range: expression
inverse of: realization of
sub property of: related endeavour
issued: 2005-07-15
change note: Added isDefinedBy property referring to FRBR core namespace
  date: 2005-08-08
  creator: Ian Davis
change note: Added definition
  date: 2005-08-09
  creator: Ian Davis

realization of
type: ObjectProperty
definition: The work that has been realized by an expression.
domain: expression
range: work
inverse of: realization
sub property of: related endeavour
issued: 2005-07-15
change note: Added isDefinedBy property referring to FRBR core namespace
  date: 2005-08-08
  creator: Ian Davis
change note: Added definition
  date: 2005-08-09
  creator: Ian Davis

embodiment
type: ObjectProperty
definition: A manifestation that embodies an expression.
domain: expression
range: manifestation
inverse of: embodiment of
sub property of: related endeavour
issued: 2005-07-15
change note: Added isDefinedBy property referring to FRBR core namespace
  date: 2005-08-08
  creator: Ian Davis
change note: Added definition
  date: 2005-08-09
  creator: Ian Davis

embodiment of
type: ObjectProperty
definition: An expression that is embodied by a manifestation.
domain: manifestation
range: expression
inverse of: embodiment
sub property of: related endeavour
issued: 2005-07-15
change note: Added isDefinedBy property referring to FRBR core namespace
  date: 2005-08-08
  creator: Ian Davis
change note: Added definition
  date: 2005-08-09
  creator: Ian Davis

exemplar
type: ObjectProperty
definition: An item that is an exemplar of a manifestation.
domain: manifestation
range: item
inverse of: exemplar of
sub property of: related endeavour
issued: 2005-07-15
change note: Added isDefinedBy property referring to FRBR core namespace
  date: 2005-08-08
  creator: Ian Davis
change note: Added definition
  date: 2005-08-09
  creator: Ian Davis

exemplar of
type: ObjectProperty
definition: The manifestation that is exemplified by a item.
domain: item
range: manifestation
inverse of: exemplar
sub property of: related endeavour
issued: 2005-07-15
change note: Added isDefinedBy property referring to FRBR core namespace
  date: 2005-08-08
  creator: Ian Davis
change note: Added definition
  date: 2005-08-09
  creator: Ian Davis

reproduction
type: ObjectProperty
definition: A reproduction of a manifestation or item.
inverse of: reproduction of
sub property of: related endeavour
domain: a manifestation or an item
  type: Class
  union of: manifestation
  union of: item
range: a manifestation or an item
  type: Class
  union of: manifestation
  union of: item
issued: 2005-07-15
change note: Added isDefinedBy property referring to FRBR core namespace
  date: 2005-08-08
  creator: Ian Davis
change note: Added definition
  date: 2005-08-09
  creator: Ian Davis
history note: Added domain and range of Manifestation or Item
  date: 2005-08-10
  creator: Ian Davis

reproduction of
type: ObjectProperty
definition: A manifestation or item that is reproduced.
inverse of: reproduction
sub property of: related endeavour
domain: a manifestation or an item
  type: Class
  union of: manifestation
  union of: item
range: a manifestation or an item
  type: Class
  union of: manifestation
  union of: item
issued: 2005-07-15
change note: Added isDefinedBy property referring to FRBR core namespace
  date: 2005-08-08
  creator: Ian Davis
change note: Added definition
  date: 2005-08-09
  creator: Ian Davis
history note: Added domain and range of Manifestation or Item
  date: 2005-08-10
  creator: Ian Davis

successor
type: ObjectProperty
definition: A successor to a work or expression.
inverse of: successor of
sub property of: related endeavour
domain: Class
  union of: work
  union of: expression
range: Class
  union of: work
  union of: expression
issued: 2005-07-15
change note: Added isDefinedBy property referring to FRBR core namespace
  date: 2005-08-08
  creator: Ian Davis
change note: Added definition
  date: 2005-08-09
  creator: Ian Davis
history note: Added domain and range of Work or Expression
  date: 2005-08-10
  creator: Ian Davis

successor of
type: ObjectProperty
definition: A work or expression that is succeeded.
inverse of: successor
domain: Class
  union of: work
  union of: expression
range: Class
  union of: work
  union of: expression
sub property of: related endeavour
issued: 2005-07-15
change note: Added isDefinedBy property referring to FRBR core namespace
  date: 2005-08-08
  creator: Ian Davis
change note: Added definition
  date: 2005-08-09
  creator: Ian Davis
history note: Added domain and range of Work or Expression
  date: 2005-08-10
  creator: Ian Davis

supplement
type: ObjectProperty
definition: A supplement to a work or expression.
inverse of: supplement of
sub property of: related endeavour
domain: Class
  union of: work
  union of: expression
range: Class
  union of: work
  union of: expression
issued: 2005-07-15
change note: Added isDefinedBy property referring to FRBR core namespace
  date: 2005-08-08
  creator: Ian Davis
change note: Added definition
  date: 2005-08-09
  creator: Ian Davis
history note: Added domain and range of Work or Expression
  date: 2005-08-10
  creator: Ian Davis

supplement of
type: ObjectProperty
definition: A work or expression that is supplemented.
inverse of: supplement
sub property of: related endeavour
domain: Class
  union of: work
  union of: expression
range: Class
  union of: work
  union of: expression
issued: 2005-07-15
change note: Added isDefinedBy property referring to FRBR core namespace
  date: 2005-08-08
  creator: Ian Davis
change note: Added definition
  date: 2005-08-09
  creator: Ian Davis
history note: Added domain and range of Work or Expression
  date: 2005-08-10
  creator: Ian Davis

complement
type: ObjectProperty
definition: A complement to a work or expression.
inverse of: complement of
sub property of: related endeavour
domain: Class
  union of: work
  union of: expression
range: Class
  union of: work
  union of: expression
issued: 2005-07-15
change note: Added isDefinedBy property referring to FRBR core namespace
  date: 2005-08-08
  creator: Ian Davis
change note: Added definition
  date: 2005-08-09
  creator: Ian Davis
history note: Added domain and range of Work or Expression
  date: 2005-08-10
  creator: Ian Davis

complement of
type: ObjectProperty
definition: A work or expression that is complemented.
inverse of: complement
sub property of: related endeavour
domain: Class
  union of: work
  union of: expression
range: Class
  union of: work
  union of: expression
issued: 2005-07-15
change note: Added isDefinedBy property referring to FRBR core namespace
  date: 2005-08-08
  creator: Ian Davis
change note: Added definition
  date: 2005-08-09
  creator: Ian Davis
history note: Added domain and range of Work or Expression
  date: 2005-08-10
  creator: Ian Davis

summarization
type: ObjectProperty
definition: A summarization of a work or expression.
inverse of: summarization of
sub property of: related endeavour
domain: Class
  union of: work
  union of: expression
range: Class
  union of: work
  union of: expression
issued: 2005-07-15
change note: Added isDefinedBy property referring to FRBR core namespace
  date: 2005-08-08
  creator: Ian Davis
change note: Added definition
  date: 2005-08-09
  creator: Ian Davis
history note: Added domain and range of Work or Expression
  date: 2005-08-10
  creator: Ian Davis

summarization of
type: ObjectProperty
definition: A work or expression that is summarized.
inverse of: summarization
sub property of: related endeavour
domain: Class
  union of: work
  union of: expression
range: Class
  union of: work
  union of: expression
issued: 2005-07-15
change note: Added isDefinedBy property referring to FRBR core namespace
  date: 2005-08-08
  creator: Ian Davis
change note: Added definition
  date: 2005-08-09
  creator: Ian Davis
history note: Added domain and range of Work or Expression
  date: 2005-08-10
  creator: Ian Davis

adaption
type: ObjectProperty
definition: An adaption of a work or expression.
inverse of: adaption of
sub property of: related endeavour
domain: Class
  union of: work
  union of: expression
range: Class
  union of: work
  union of: expression
issued: 2005-07-15
change note: Added isDefinedBy property referring to FRBR core namespace
  date: 2005-08-08
  creator: Ian Davis
change note: Added definition
  date: 2005-08-09
  creator: Ian Davis
history note: Added domain and range of Work or Expression
  date: 2005-08-10
  creator: Ian Davis

adaption of
type: ObjectProperty
definition: A work or expression that is adapted.
inverse of: adaption
sub property of: related endeavour
domain: Class
  union of: work
  union of: expression
range: Class
  union of: work
  union of: expression
issued: 2005-07-15
change note: Added isDefinedBy property referring to FRBR core namespace
  date: 2005-08-08
  creator: Ian Davis
change note: Added definition
  date: 2005-08-09
  creator: Ian Davis
history note: Added domain and range of Work or Expression
  date: 2005-08-10
  creator: Ian Davis

transformation
type: ObjectProperty
definition: A transformation of a work or expression.
inverse of: transformation of
sub property of: related endeavour
domain: Class
  union of: work
  union of: expression
range: Class
  union of: work
  union of: expression
issued: 2005-07-15
change note: Added isDefinedBy property referring to FRBR core namespace
  date: 2005-08-08
  creator: Ian Davis
change note: Added definition
  date: 2005-08-09
  creator: Ian Davis
history note: Added domain and range of Work or Expression
  date: 2005-08-10
  creator: Ian Davis

transformation of
type: ObjectProperty
definition: A work or expression that is transformed.
inverse of: transformation
sub property of: related endeavour
domain: Class
  union of: work
  union of: expression
range: Class
  union of: work
  union of: expression
issued: 2005-07-15
change note: Added isDefinedBy property referring to FRBR core namespace
  date: 2005-08-08
  creator: Ian Davis
change note: Added definition
  date: 2005-08-09
  creator: Ian Davis
history note: Added domain and range of Work or Expression
  date: 2005-08-10
  creator: Ian Davis

imitation
type: ObjectProperty
definition: An imitation of a work or expression.
inverse of: imitation of
sub property of: related endeavour
domain: Class
  union of: work
  union of: expression
range: Class
  union of: work
  union of: expression
issued: 2005-07-15
change note: Added isDefinedBy property referring to FRBR core namespace
  date: 2005-08-08
  creator: Ian Davis
change note: Added definition
  date: 2005-08-09
  creator: Ian Davis
history note: Added domain and range of Work or Expression
  date: 2005-08-10
  creator: Ian Davis

imitation of
type: ObjectProperty
definition: A work or expression that is imitated.
inverse of: imitation
sub property of: related endeavour
domain: Class
  union of: work
  union of: expression
range: Class
  union of: work
  union of: expression
issued: 2005-07-15
change note: Added isDefinedBy property referring to FRBR core namespace
  date: 2005-08-08
  creator: Ian Davis
change note: Added definition
  date: 2005-08-09
  creator: Ian Davis
history note: Added domain and range of Work or Expression
  date: 2005-08-10
  creator: Ian Davis

abridgement
type: ObjectProperty
definition: An abridgment of an expression.
inverse of: abridgement of
sub property of: related endeavour
domain: expression
range: expression
issued: 2005-07-15
change note: Added isDefinedBy property referring to FRBR core namespace
  date: 2005-08-08
  creator: Ian Davis
change note: Added definition
  date: 2005-08-09
  creator: Ian Davis
history note: Added domain and range of Expression
  date: 2005-08-10
  creator: Ian Davis

abridgement of
type: ObjectProperty
definition: An expression that is abridged.
inverse of: abridgement
sub property of: related endeavour
domain: expression
range: expression
issued: 2005-07-15
change note: Added isDefinedBy property referring to FRBR core namespace
  date: 2005-08-08
  creator: Ian Davis
change note: Added definition
  date: 2005-08-09
  creator: Ian Davis
history note: Added domain and range of Expression
  date: 2005-08-10
  creator: Ian Davis

revision
type: ObjectProperty
definition: A revision of an expression.
inverse of: revision of
sub property of: related endeavour
domain: expression
range: expression
issued: 2005-07-15
change note: Added isDefinedBy property referring to FRBR core namespace
  date: 2005-08-08
  creator: Ian Davis
change note: Added definition
  date: 2005-08-09
  creator: Ian Davis
history note: Added domain and range of Expression
  date: 2005-08-10
  creator: Ian Davis

revision of
type: ObjectProperty
definition: An expression that is revised.
inverse of: revision
domain: expression
range: expression
sub property of: related endeavour
issued: 2005-07-15
change note: Added isDefinedBy property referring to FRBR core namespace
  date: 2005-08-08
  creator: Ian Davis
change note: Added definition
  date: 2005-08-09
  creator: Ian Davis
history note: Added domain and range of Expression
  date: 2005-08-10
  creator: Ian Davis

translation
type: ObjectProperty
definition: A translation of an expression.
inverse of: translation of
sub property of: related endeavour
domain: expression
range: expression
issued: 2005-07-15
change note: Added isDefinedBy property referring to FRBR core namespace
  date: 2005-08-08
  creator: Ian Davis
change note: Added definition
  date: 2005-08-09
  creator: Ian Davis
history note: Added domain and range of Expression
  date: 2005-08-10
  creator: Ian Davis

translation of
type: ObjectProperty
definition: An expression that is translated.
inverse of: translation
sub property of: related endeavour
domain: expression
range: expression
issued: 2005-07-15
change note: Added isDefinedBy property referring to FRBR core namespace
  date: 2005-08-08
  creator: Ian Davis
change note: Added definition
  date: 2005-08-09
  creator: Ian Davis
history note: Added domain and range of Expression
  date: 2005-08-10
  creator: Ian Davis

arrangement
type: ObjectProperty
definition: An arrangement of an expression.
inverse of: arrangement of
sub property of: related endeavour
domain: expression
range: expression
issued: 2005-07-15
change note: Added isDefinedBy property referring to FRBR core namespace
  date: 2005-08-08
  creator: Ian Davis
change note: Added definition
  date: 2005-08-09
  creator: Ian Davis
history note: Added domain and range of Expression
  date: 2005-08-10
  creator: Ian Davis

arrangement of
type: ObjectProperty
definition: An expression that is arranged.
inverse of: arrangement
sub property of: related endeavour
domain: expression
range: expression
issued: 2005-07-15
change note: Added isDefinedBy property referring to FRBR core namespace
  date: 2005-08-08
  creator: Ian Davis
change note: Added definition
  date: 2005-08-09
  creator: Ian Davis
history note: Added domain and range of Expression
  date: 2005-08-10
  creator: Ian Davis

alternate
type: ObjectProperty
definition: An alternative to a manifestation.
domain: manifestation
range: manifestation
sub property of: related endeavour
inverse of: alternate of
issued: 2005-08-10

alternate of
type: ObjectProperty
definition: A manifestation that is alternated.
domain: manifestation
range: manifestation
sub property of: related endeavour
inverse of: alternate
issued: 2005-08-10

reconfiguration
type: ObjectProperty
definition: A recongifuration of an item.
domain: item
range: item
sub property of: related endeavour
inverse of: reconfiguration of
issued: 2005-08-10

reconfiguration of
type: ObjectProperty
definition: An item that is reconfigured.
domain: item
range: item
sub property of: related endeavour
inverse of: reconfiguration
issued: 2005-08-10

part
type: ObjectProperty
definition: A part of an endeavour.
inverse of: part of
sub property of: related endeavour
issued: 2005-07-15
change note: Added isDefinedBy property referring to FRBR core namespace
  date: 2005-08-08
  creator: Ian Davis
change note: Added definition
  date: 2005-08-09
  creator: Ian Davis

part of
type: ObjectProperty
definition: An endeavour incorporating an endeavour.
inverse of: part
sub property of: related endeavour
issued: 2005-07-15
change note: Added isDefinedBy property referring to FRBR core namespace
  date: 2005-08-08
  creator: Ian Davis
change note: Added definition
  date: 2005-08-09
  creator: Ian Davis

responsible entity
type: ObjectProperty
definition: An entity in some way responsible for an endeavour.
domain: endeavour
range: responsible entity
inverse of: responsible entity of
issued: 2005-07-15
change note: Added isDefinedBy property referring to FRBR core namespace
  date: 2005-08-08
  creator: Ian Davis
change note: Added definition
  date: 2005-08-09
  creator: Ian Davis

responsible entity of
type: ObjectProperty
definition: An endeavour that is the responsibility of an entity.
domain: responsible entity
range: endeavour
inverse of: responsible entity
issued: 2005-07-15
change note: Added isDefinedBy property referring to FRBR core namespace
  date: 2005-08-08
  creator: Ian Davis
change note: Added definition
  date: 2005-08-09
  creator: Ian Davis

creator
type: ObjectProperty
definition: An entity in some way responsible for the creation of a work.
domain: work
range: responsible entity
sub property of: responsible entity
inverse of: creator of
issued: 2005-07-15
change note: Added isDefinedBy property referring to FRBR core namespace
  date: 2005-08-08
  creator: Ian Davis
change note: Added definition
  date: 2005-08-09
  creator: Ian Davis

creator of
type: ObjectProperty
definition: A work that was in some way created by of an entity.
domain: responsible entity
range: work
sub property of: responsible entity of
inverse of: creator
issued: 2005-07-15
change note: Added isDefinedBy property referring to FRBR core namespace
  date: 2005-08-08
  creator: Ian Davis
change note: Added definition
  date: 2005-08-09
  creator: Ian Davis

realizer
type: ObjectProperty
definition: An entity in some way responsible for realizing an expression.
domain: expression
range: responsible entity
sub property of: responsible entity
inverse of: realizer of
issued: 2005-07-15
change note: Added isDefinedBy property referring to FRBR core namespace
  date: 2005-08-08
  creator: Ian Davis
change note: Added definition
  date: 2005-08-09
  creator: Ian Davis

realizer of
type: ObjectProperty
definition: An expression that was in some way realized by an entity.
domain: responsible entity
range: expression
sub property of: responsible entity of
inverse of: realizer
issued: 2005-07-15
change note: Added isDefinedBy property referring to FRBR core namespace
  date: 2005-08-08
  creator: Ian Davis
change note: Added definition
  date: 2005-08-09
  creator: Ian Davis

producer
type: ObjectProperty
definition: An entity in some way responsible for producing a manifestation.
domain: manifestation
range: responsible entity
sub property of: responsible entity
inverse of: producer of
issued: 2005-07-15
change note: Added isDefinedBy property referring to FRBR core namespace
  date: 2005-08-08
  creator: Ian Davis
change note: Added definition
  date: 2005-08-09
  creator: Ian Davis

producer of
type: ObjectProperty
definition: A manifestation that was in some way produced an entity.
domain: responsible entity
range: manifestation
sub property of: responsible entity of
inverse of: producer
issued: 2005-07-15
change note: Added isDefinedBy property referring to FRBR core namespace
  date: 2005-08-08
  creator: Ian Davis
change note: Added definition
  date: 2005-08-09
  creator: Ian Davis

owner
type: ObjectProperty
definition: An entity that owns an item.
domain: item
range: responsible entity
sub property of: responsible entity
inverse of: owner of
issued: 2005-07-15
change note: Added isDefinedBy property referring to FRBR core namespace
  date: 2005-08-08
  creator: Ian Davis
change note: Added definition
  date: 2005-08-09
  creator: Ian Davis

owner of
type: ObjectProperty
definition: An item that is in some way owned an entity.
domain: responsible entity
range: item
sub property of: responsible entity of
inverse of: owner
issued: 2005-07-15
change note: Added isDefinedBy property referring to FRBR core namespace
  date: 2005-08-08
  creator: Ian Davis
change note: Added definition
  date: 2005-08-09
  creator: Ian Davis

subject
type: ObjectProperty
definition: The subject of a work.
domain: work
range: Class
  union of: endeavour
  union of: responsible entity
  union of: subject
issued: 2005-07-15
change note: Added isDefinedBy property referring to FRBR core namespace
  date: 2005-08-08
  creator: Ian Davis
change note: Added definition
  date: 2005-08-09
  creator: Ian Davis